{"text_format":"3","workbook":"xlsx","n_sheets":4,"sheets":["Loan Type","Purchase","Cash Out","county limits"],"not_rendered":{"images":3,"macros":1,"external_links":1,"defined_names":43},"read":"whole","date_system":"1900"}

{"sheet":"Loan Type","index":0,"n_rows":59,"n_cols":14,"rows_kept":59,"merged":[[1,1,1,11],[3,1,3,11],[4,1,4,11],[5,1,5,11],[6,4,6,6],[7,4,7,6],[7,9,7,11],[9,1,9,11],[17,5,17,7],[18,5,18,7],[19,3,19,5],[19,8,19,10],[58,0,67,11]]}
[]
[null,"VA Joint Loan Worksheet-2026"]
[]
[null,"To be used for Joint Loan transactions only."]
[null,"This does not apply to any other VA Loan type worksheet"]
[null,"Fill in the yellow fields then select Purchase or Cash Out Buttons"]
[{"$nulls":3},"Borrower Name:"]
[{"$nulls":3},"Loan Number:",{"$nulls":4},"VA Loan Number:"]
[]
[null,"Section I - Buyer and COE Information",{"$nulls":11},"Information is Gathered from the COE"]
[null,"Buyers","Veteran  Y/N","COE Ent Code","FF Exempt","Active/ Res","1st Time Use",null,"Previous Ent Used",{"$nulls":4},"Veteran Y/N: if Veteran then \"Y\" if not Veteran then \"N\" and don't fill in rest of grid"]
[null,"Buyer 1",{"$nulls":11},"Active-Reserve/NG: If Ent code 11 then R/NG otherwise Active"]
[null,"Buyer 2",{"$nulls":11},"Add all entitlement charged from grid on COE for each Veteran"]
[null,"Buyer 3",{"$nulls":11},"Determine 1st time use from conditions at bottom, if \"Subsequent Use\" condition then answer \"N\""]
[null,"Buyer 4"]
[null,"Buyer 5"]
[{"$nulls":8},{"$f":"SUM(I12:I16)","v":0}]
[{"$nulls":4},"State","County"]
[]
[null,null,"Completed By:",{"$f":"getusername()","v":"michelle.b.crumley"},{"$nulls":3},"Date of Calculation:",{"$f":"TODAY()","v":"2025-12-06"}]
{"$rows_left_out":6}
{"sheet":"Purchase","index":1,"n_rows":85,"n_cols":21,"rows_kept":85,"merged":[[0,13,0,23],[1,1,1,11],[5,1,5,11],[6,4,6,6],[7,4,7,6],[7,9,7,11],[9,1,9,11],[17,3,17,5],[17,8,17,10],[19,1,19,11],[28,7,28,9],[31,9,31,10],[33,1,33,11],[45,1,45,11],[52,1,52,11],[54,9,54,10],[55,9,55,10],[56,9,56,10],[57,9,57,10],[58,9,58,10],[60,1,60,11],[72,1,72,11],[76,3,76,4],[77,3,77,4],[78,3,78,4],[79,3,79,4],[80,3,80,4],[81,3,81,4],[84,1,91,11]]}
[]
[null,"VA Joint Loan Purchase Worksheet-2026"]
[{"$nulls":14},"Yes","More than 1 vet?",null,null,"NO"]
[{"$nulls":4},"        To be used for Joint Loan PURCHASE transactions only.",{"$nulls":8},{"v":345307.76875,"d":"345308"},{"$f":"IF(L24>1,\"Y\",\"N\")","v":"N"},"More than 1 vet?",null,null,{"$f":"IF(O4=\"N\",IF(I17>0,MIN(J17*4,L29,L26),L26),\"\")","v":{"$error":"#DIV/0!"}}]
[{"$nulls":4},"        This does not apply to any other VA Loan type worksheet",{"$nulls":8},{"$f":"IF(DP>0,TOT_LN,\"\")","v":{"$error":"#DIV/0!"}},{"$f":"IF(O4=\"Y\",IF(K23=\"Y\",IF(I17>0,IF(O8<>L24,L26,MIN(J17*4,L29,L26)),L26),IF(I17>0,MIN(J17*4,L29,L26),L26)),S4)","v":{"$error":"#DIV/0!"}},"Calculated max based on",null,null,{"$f":"IF(O4=\"Y\",IF(K23=\"Y\",IF(I17>0,IF(O8<>L24,L26,MIN(J17*4,L29,L26)),L26),IF(I17>0,MIN(J17*4,L29,L26),L26)),S4)","v":{"$error":"#DIV/0!"}}]
[{"$nulls":13},0.0125,null,"married>previous use"]
[{"$nulls":3},"Borrower Name:",{"$f":"IF('Loan Type'!E7=\"\",\"\",'Loan Type'!E7)","v":""},{"$f":"IF('Loan Type'!F7=\"\",\"\",'Loan Type'!F7)","v":""},{"$f":"IF('Loan Type'!G7=\"\",\"\",'Loan Type'!G7)","v":""}]
[{"$nulls":3}," Loan Number:",{"$f":"IF('Loan Type'!E8=\"\",\"\",'Loan Type'!E8)","v":""},{"$f":"IF('Loan Type'!F8=\"\",\"\",'Loan Type'!F8)","v":""},{"$f":"IF('Loan Type'!G8=\"\",\"\",'Loan Type'!G8)","v":""},null,"VA Loan Number:",{"$f":"IF('Loan Type'!J8=\"\",\"\",'Loan Type'!J8)","v":""},{"$f":"IF('Loan Type'!K8=\"\",\"\",'Loan Type'!K8)","v":""},{"$f":"IF('Loan Type'!L8=\"\",\"\",'Loan Type'!L8)","v":""},null,null,{"$f":"COUNTIF(I12:I16,\">0\")","v":0},"count of previous used entitlement"]
[]
[null,"Section I - Buyer and COE Information",{"$nulls":12},"Exempt or not",{"$f":"IF(AND($K36>=5%,$K36<10%),5,IF($K36>=10%,10,0))","v":{"$error":"#DIV/0!"}},{"$f":"IF(AND($K36>=5%,$K36<10%),5,IF($K36>=10%,10,0))","v":{"$error":"#DIV/0!"}},{"$f":"IF(AND($K36>=5%,$K36<10%),5,IF($K36>=10%,10,0))","v":{"$error":"#DIV/0!"}},{"$f":"IF(AND($K36>=5%,$K36<10%),5,IF($K36>=10%,10,0))","v":{"$error":"#DIV/0!"}},{"$f":"IF(AND($K36>=5%,$K36<10%),5,IF($K36>=10%,10,0))","v":{"$error":"#DIV/0!"}}]
[null,"Buyers","Veteran  Y/N","COE Ent Code","FF Exempt","Active/ Res","1st Time Use","Portion","Previous Ent Used","Entitlement Available","Funding Fee %","Funding Fee $"]
[null,"Buyer 1",{"$f":"IF('Loan Type'!C12=\"\",\"\",'Loan Type'!C12)","v":""},{"$f":"IF('Loan Type'!D12=\"\",\"\",'Loan Type'!D12)","v":""},{"$f":"IF('Loan Type'!E12=\"\",\"\",'Loan Type'!E12)","v":""},{"$f":"IF('Loan Type'!F12=\"\",\"\",'Loan Type'!F12)","v":""},{"$f":"IF('Loan Type'!G12=\"\",\"\",'Loan Type'!G12)","v":""},{"$f":"IF(C12=\"\",\"\",TotBaseLn/L$23)","v":""},{"$f":"'Loan Type'!I12","v":0},{"$f":"IF(C12=\"Y\",IF(I12>0,MAX((L$29*0.25)-I12,0),MIN(VAL,PRIC)*0.25),\"\")","v":""},{"$f":"IF(OR(C12=\"N\",C12=\"\"),\"\",P18%)","v":""},{"$f":"IF(OR(C12=\"N\",C12=\"\"),\"\",H12*K12)","v":""},{"$f":"VLOOKUP(\"Not Eligible\",J12:J16,1,TRUE)","v":""},null,"Base calculation",{"$f":"IF($E12=\"Y\",0,P13)","v":3.3},{"$f":"IF($E13=\"Y\",0,Q13)","v":3.3},{"$f":"IF($E14=\"Y\",0,R13)","v":3.3},{"$f":"IF($E15=\"Y\",0,S13)","v":3.3},{"$f":"IF($E16=\"Y\",0,T13)","v":3.3}]
[null,"Buyer 2",{"$f":"IF('Loan Type'!C13=\"\",\"\",'Loan Type'!C13)","v":""},{"$f":"IF('Loan Type'!D13=\"\",\"\",'Loan Type'!D13)","v":""},{"$f":"IF('Loan Type'!E13=\"\",\"\",'Loan Type'!E13)","v":""},{"$f":"IF('Loan Type'!F13=\"\",\"\",'Loan Type'!F13)","v":""},{"$f":"IF('Loan Type'!G13=\"\",\"\",'Loan Type'!G13)","v":""},{"$f":"IF(C13=\"\",\"\",TotBaseLn/L$23)","v":""},{"$f":"'Loan Type'!I13","v":0},{"$f":"IF(C13=\"Y\",IF(I13>0,MAX((L$29*0.25)-I13,0),MIN(VAL,PRIC)*0.25),\"\")","v":""},{"$f":"IF(OR(C13=\"N\",C13=\"\"),\"\",Q19%)","v":""},{"$f":"IF(OR(C13=\"N\",C13=\"\"),\"\",H13*K13)","v":""},null,null,"First time use eligibility code",{"$f":"IF(AND($G12=\"Y\",OR($D12=1,$D12=2,$D12=3,$D12=4,$D12=8,$D12=9,$D12=10)),2.15,P14)","v":3.3},{"$f":"IF(AND($G13=\"Y\",OR($D13=1,$D13=2,$D13=3,$D13=4,$D13=8,$D13=9,$D13=10)),2.15,Q14)","v":3.3},{"$f":"IF(AND($G14=\"Y\",OR($D14=1,$D14=2,$D14=3,$D14=4,$D14=8,$D14=9,$D14=10)),2.15,R14)","v":3.3},{"$f":"IF(AND($G15=\"Y\",OR($D15=1,$D15=2,$D15=3,$D15=4,$D15=8,$D15=9,$D15=10)),2.15,S14)","v":3.3},{"$f":"IF(AND($G16=\"Y\",OR($D16=1,$D16=2,$D16=3,$D16=4,$D16=8,$D16=9,$D16=10)),2.15,T14)","v":3.3}]
[null,"Buyer 3",{"$f":"IF('Loan Type'!C14=\"\",\"\",'Loan Type'!C14)","v":""},{"$f":"IF('Loan Type'!D14=\"\",\"\",'Loan Type'!D14)","v":""},{"$f":"IF('Loan Type'!E14=\"\",\"\",'Loan Type'!E14)","v":""},{"$f":"IF('Loan Type'!F14=\"\",\"\",'Loan Type'!F14)","v":""},{"$f":"IF('Loan Type'!G14=\"\",\"\",'Loan Type'!G14)","v":""},{"$f":"IF(C14=\"\",\"\",TotBaseLn/L$23)","v":""},{"$f":"'Loan Type'!I14","v":0},{"$f":"IF(C14=\"Y\",IF(I14>0,MAX((L$29*0.25)-I14,0),MIN(VAL,PRIC)*0.25),\"\")","v":""},{"$f":"IF(OR(C14=\"N\",C14=\"\"),\"\",R18%)","v":""},{"$f":"IF(OR(C14=\"N\",C14=\"\"),\"\",H14*K14)","v":""},null,null,"Reserve eligibility code",{"$f":"IF(AND($D12=11,$G12=\"Y\"),2.15,P15)","v":3.3},{"$f":"IF(AND($D13=11,$G13=\"Y\"),2.15,Q15)","v":3.3},{"$f":"IF(AND($D14=11,$G14=\"Y\"),2.15,R15)","v":3.3},{"$f":"IF(AND($D15=11,$G15=\"Y\"),2.15,S15)","v":3.3},{"$f":"IF(AND($D16=11,$G16=\"Y\"),2.15,T15)","v":3.3}]
[null,"Buyer 4",{"$f":"IF('Loan Type'!C15=\"\",\"\",'Loan Type'!C15)","v":""},{"$f":"IF('Loan Type'!D15=\"\",\"\",'Loan Type'!D15)","v":""},{"$f":"IF('Loan Type'!E15=\"\",\"\",'Loan Type'!E15)","v":""},{"$f":"IF('Loan Type'!F15=\"\",\"\",'Loan Type'!F15)","v":""},{"$f":"IF('Loan Type'!G15=\"\",\"\",'Loan Type'!G15)","v":""},{"$f":"IF(C15=\"\",\"\",TotBaseLn/L$23)","v":""},{"$f":"'Loan Type'!I15","v":0},{"$f":"IF(C15=\"Y\",IF(I15>0,MAX((L$29*0.25)-I15,0),MIN(VAL,PRIC)*0.25),\"\")","v":""},{"$f":"IF(OR(C15=\"N\",C15=\"\"),\"\",S18%)","v":""},{"$f":"IF(OR(C15=\"N\",C15=\"\"),\"\",H15*K15)","v":""},null,null,"Surviving Spouse/POW eligibility code",{"$f":"IF(OR($D12=6,$D12=7),0,P16)","v":3.3},{"$f":"IF(OR($D13=6,$D13=7),0,Q16)","v":3.3},{"$f":"IF(OR($D14=6,$D14=7),0,R16)","v":3.3},{"$f":"IF(OR($D15=6,$D15=7),0,S16)","v":3.3},{"$f":"IF(OR($D16=6,$D16=7),0,T16)","v":3.3}]
[null,"Buyer 5",{"$f":"IF('Loan Type'!C16=\"\",\"\",'Loan Type'!C16)","v":""},{"$f":"IF('Loan Type'!D16=\"\",\"\",'Loan Type'!D16)","v":""},{"$f":"IF('Loan Type'!E16=\"\",\"\",'Loan Type'!E16)","v":""},{"$f":"IF('Loan Type'!F16=\"\",\"\",'Loan Type'!F16)","v":""},{"$f":"IF('Loan Type'!G16=\"\",\"\",'Loan Type'!G16)","v":""},{"$f":"IF(C16=\"\",\"\",TotBaseLn/L$23)","v":""},{"$f":"'Loan Type'!I16","v":0},{"$f":"IF(C16=\"Y\",IF(I16>0,MAX((L$29*0.25)-I16,0),MIN(VAL,PRIC)*0.25),\"\")","v":""},{"$f":"IF(OR(C16=\"N\",C16=\"\"),\"\",T18%)","v":""},{"$f":"IF(OR(C16=\"N\",C16=\"\"),\"\",H16*K16)","v":""},null,null,"second time use",3.3,3.3,3.3,3.3,3.3]
[{"$nulls":8},{"$f":"SUM(I12:I16)","v":0},{"$f":"SUM(J12:J16)","v":0},{"$f":"L17/L37","v":{"$error":"#DIV/0!"}},{"$f":"SUM(L12:L16)","v":0}]
[null,null,"Completed By:",{"$f":"'Loan Type'!D20","v":"michelle.b.crumley"},{"$nulls":3},"Date of Calculation:",{"$f":"'Loan Type'!I20","v":"2025-12-06"},null,null,{"$f":"L17/L49","v":{"$error":"#DIV/0!"}},null,null,"Active vs. R/NG",{"$f":"IF($F12=\"Reserve/NG\",P24,P19)","v":{"$error":"#DIV/0!"}},{"$f":"IF($F13=\"Reserve/NG\",Q24,Q19)","v":{"$error":"#DIV/0!"}},{"$f":"IF($F14=\"Reserve/NG\",R24,R19)","v":{"$error":"#DIV/0!"}},{"$f":"IF($F15=\"Reserve/NG\",S24,S19)","v":{"$error":"#DIV/0!"}},{"$f":"IF($F16=\"Reserve/NG\",T24,T19)","v":{"$error":"#DIV/0!"}}]
[{"$nulls":14},"Exempt calc",{"$f":"IF(P12=0,0,P20)","v":{"$error":"#DIV/0!"}},{"$f":"IF(Q12=0,0,Q20)","v":{"$error":"#DIV/0!"}},{"$f":"IF(R12=0,0,R20)","v":{"$error":"#DIV/0!"}},{"$f":"IF(S12=0,0,S20)","v":{"$error":"#DIV/0!"}},{"$f":"IF(T12=0,0,T20)","v":{"$error":"#DIV/0!"}},"Information is Gathered from the new loan information"]
[null,"Section II - Borrower Equity Requirement",{"$nulls":12},"DP<5%",{"$f":"IF(AND(P12>0,P10=0),P12,P21)","v":{"$error":"#DIV/0!"}},{"$f":"IF(AND(Q12>0,Q10=0),Q12,Q21)","v":{"$error":"#DIV/0!"}},{"$f":"IF(AND(R12>0,R10=0),R12,R21)","v":{"$error":"#DIV/0!"}},{"$f":"IF(AND(S12>0,S10=0),S12,S21)","v":{"$error":"#DIV/0!"}},{"$f":"IF(AND(T12>0,T10=0),T12,T21)","v":{"$error":"#DIV/0!"}}]
{"$rows_left_out":66}
{"sheet":"Cash Out","index":2,"n_rows":85,"n_cols":25,"rows_kept":85,"merged":[[1,1,1,11],[2,1,2,11],[5,1,5,11],[6,4,6,6],[7,4,7,6],[7,9,7,11],[9,1,9,11],[17,1,17,2],[17,3,17,5],[17,8,17,10],[19,1,19,11],[28,7,28,9],[31,9,31,10],[33,1,33,11],[45,1,45,11],[52,1,52,11],[58,9,58,10],[60,1,60,11],[72,1,72,11],[76,3,76,4],[77,3,77,4],[78,3,78,4],[79,3,79,4],[80,3,80,4],[81,3,81,4],[84,1,91,11]]}
[]
[null,"VA Joint Loan Refinance Worksheet-2026"]
[]
[{"$nulls":3},"To be used for Joint Loan Cash Out REFINANCE transactions only."]
[{"$nulls":3},"This does not apply to any other VA Loan type worksheet",{"$nulls":10},"Yes","More than 1 vet?",null,null,"NO"]
[null,"3 or more Veterans w/previous used entitlement, Contact Military & Veteran Lending for more assistance",{"$nulls":12},{"$f":"IF(L24>1,\"Y\",\"N\")","v":"N"},"More than 1 vet?",null,null,{"$f":"IF(O6=\"N\",IF(I17>0,MIN(J17*4,L29,L26),L26),\"\")","v":{"$error":"#DIV/0!"}}]
[{"$nulls":3},"Borrower Name:",{"$f":"IF('Loan Type'!E7=\"\",\"\",'Loan Type'!E7)","v":""},{"$nulls":9},{"$f":"IF(O6=\"Y\",IF(K23=\"Y\",IF(I17>0,IF(O10<>L24,L26,MIN(J17*4,L29,L26)),L26),IF(I17>0,MIN(J17*4,L29,L26),L26)),S6)","v":{"$error":"#DIV/0!"}},"Calculated max based on"]
[{"$nulls":3},"Loan Number:",{"$f":"IF('Loan Type'!E8=\"\",\"\",'Loan Type'!E8)","v":""},{"$nulls":3},"VA Loan Number:",{"$nulls":6},"married>previous use"]
[]
[null,"Section I - Buyer and COE Information",{"$nulls":12},{"$f":"COUNTIF(I12:I16,\">0\")","v":0},"count of previous used entitlement"]
[null,"Buyers","Veteran  Y/N","COE Ent Code","FF Exempt","Active/ Res","First Time Use","Portion","Entitlement Charged","Entitlement Available","Funding Fee %","Funding Fee $"]
[null,"Buyer 1",{"$f":"IF('Loan Type'!C12=\"\",\"\",'Loan Type'!C12)","v":""},{"$f":"IF('Loan Type'!D12=\"\",\"\",'Loan Type'!D12)","v":""},{"$f":"IF('Loan Type'!E12=\"\",\"\",'Loan Type'!E12)","v":""},{"$f":"IF('Loan Type'!F12=\"\",\"\",'Loan Type'!F12)","v":""},{"$f":"IF('Loan Type'!G12=\"\",\"\",'Loan Type'!G12)","v":""},{"$f":"IF(C12=\"\",\"\",L22/L23)","v":""},{"$f":"'Loan Type'!I12","v":0},{"$f":"IF(C12=\"Y\",MAX((L$29*0.25)-I12,0),\"\")","v":""},{"$f":"IF(OR(C12=\"N\",C12=\"\"),\"\",P23%)","v":""},{"$f":"IF(OR(C12=\"N\",C12=\"\"),\"\",H12*K12)","v":""}]
[null,"Buyer 2",{"$f":"IF('Loan Type'!C13=\"\",\"\",'Loan Type'!C13)","v":""},{"$f":"IF('Loan Type'!D13=\"\",\"\",'Loan Type'!D13)","v":""},{"$f":"IF('Loan Type'!E13=\"\",\"\",'Loan Type'!E13)","v":""},{"$f":"IF('Loan Type'!F13=\"\",\"\",'Loan Type'!F13)","v":""},{"$f":"IF('Loan Type'!G13=\"\",\"\",'Loan Type'!G13)","v":""},{"$f":"IF(C13=\"\",\"\",L22/L23)","v":""},{"$f":"'Loan Type'!I13","v":0},{"$f":"IF(C13=\"Y\",MAX((L$29*0.25)-I13,0),\"\")","v":""},{"$f":"IF(OR(C13=\"N\",C13=\"\"),\"\",Q23%)","v":""},{"$f":"IF(OR(C13=\"N\",C13=\"\"),\"\",H13*K13)","v":""}]
[null,"Buyer 3",{"$f":"IF('Loan Type'!C14=\"\",\"\",'Loan Type'!C14)","v":""},{"$f":"IF('Loan Type'!D14=\"\",\"\",'Loan Type'!D14)","v":""},{"$f":"IF('Loan Type'!E14=\"\",\"\",'Loan Type'!E14)","v":""},{"$f":"IF('Loan Type'!F14=\"\",\"\",'Loan Type'!F14)","v":""},{"$f":"IF('Loan Type'!G14=\"\",\"\",'Loan Type'!G14)","v":""},{"$f":"IF(C14=\"\",\"\",L22/L23)","v":""},{"$f":"'Loan Type'!I14","v":0},{"$f":"IF(C14=\"Y\",MAX((L$29*0.25)-I14,0),\"\")","v":""},{"$f":"IF(OR(C14=\"N\",C14=\"\"),\"\",R23%)","v":""},{"$f":"IF(OR(C14=\"N\",C14=\"\"),\"\",H14*K14)","v":""}]
[null,"Buyer 4",{"$f":"IF('Loan Type'!C15=\"\",\"\",'Loan Type'!C15)","v":""},{"$f":"IF('Loan Type'!D15=\"\",\"\",'Loan Type'!D15)","v":""},{"$f":"IF('Loan Type'!E15=\"\",\"\",'Loan Type'!E15)","v":""},{"$f":"IF('Loan Type'!F15=\"\",\"\",'Loan Type'!F15)","v":""},{"$f":"IF('Loan Type'!G15=\"\",\"\",'Loan Type'!G15)","v":""},{"$f":"IF(C15=\"\",\"\",L22/L23)","v":""},{"$f":"'Loan Type'!I15","v":0},{"$f":"IF(C15=\"Y\",MAX((L$29*0.25)-I15,0),\"\")","v":""},{"$f":"IF(OR(C15=\"N\",C15=\"\"),\"\",S23%)","v":""},{"$f":"IF(OR(C15=\"N\",C15=\"\"),\"\",H15*K15)","v":""},null,null,"Exempt or not",{"$f":"IF(AND($K37>=5%,$K37<10%),5,IF($K37>=10%,10,0))","v":0},{"$f":"IF(AND($K37>=5%,$K37<10%),5,IF($K37>=10%,10,0))","v":0},{"$f":"IF(AND($K37>=5%,$K37<10%),5,IF($K37>=10%,10,0))","v":0},{"$f":"IF(AND($K37>=5%,$K37<10%),5,IF($K37>=10%,10,0))","v":0},{"$f":"IF(AND($K37>=5%,$K37<10%),5,IF($K37>=10%,10,0))","v":0},"V/N/N/N/N 20%",0.2,0.2]
[null,"Buyer 5",{"$f":"IF('Loan Type'!C16=\"\",\"\",'Loan Type'!C16)","v":""},{"$f":"IF('Loan Type'!D16=\"\",\"\",'Loan Type'!D16)","v":""},{"$f":"IF('Loan Type'!E16=\"\",\"\",'Loan Type'!E16)","v":""},{"$f":"IF('Loan Type'!F16=\"\",\"\",'Loan Type'!F16)","v":""},{"$f":"IF('Loan Type'!G16=\"\",\"\",'Loan Type'!G16)","v":""},{"$f":"IF(C16=\"\",\"\",L22/L23)","v":""},{"$f":"'Loan Type'!I16","v":0},{"$f":"IF(C16=\"Y\",MAX((L$29*0.25)-I16,0),\"\")","v":""},{"$f":"IF(OR(C16=\"N\",C16=\"\"),\"\",T23%)","v":""},{"$f":"IF(OR(C16=\"N\",C16=\"\"),\"\",H16*K16)","v":""},{"$nulls":8},"V/N/N/N 25%",0.25,0.19]
[{"$nulls":8},{"$f":"SUM(I12:I16)","v":0},{"$f":"SUM(J12:J16)","v":0},{"$f":"L17/L26","v":{"$error":"#DIV/0!"}},{"$f":"SUM(L12:L16)","v":0},null,null,"Base calculation",{"$f":"IF($E12=\"Y\",0,P18)","v":3.3},{"$f":"IF($E13=\"Y\",0,Q18)","v":3.3},{"$f":"IF($E14=\"Y\",0,R18)","v":3.3},{"$f":"IF($E15=\"Y\",0,S18)","v":3.3},{"$f":"IF($E16=\"Y\",0,T18)","v":3.3},"V/N/N 33.3%",0.333,0.18182]
[null,"Completed By:",{"$nulls":5},"Date of Calculation:",{"$f":"TODAY()","v":"2025-12-06"},null,null,{"$f":"IF(OR(C14=\"N\",C14=\"\"),\"\",H14*K14)","v":""},null,null,"First time use eligibility code",{"$f":"IF(AND($G12=\"Y\",OR($D12=1,$D12=2,$D12=3,$D12=4,$D12=8,$D12=9,$D12=10)),2.15,P19)","v":3.3},{"$f":"IF(AND($G13=\"Y\",OR($D13=1,$D13=2,$D13=3,$D13=4,$D13=8,$D13=9,$D13=10)),2.15,Q19)","v":3.3},{"$f":"IF(AND($G14=\"Y\",OR($D14=1,$D14=2,$D14=3,$D14=4,$D14=8,$D14=9,$D14=10)),2.15,R19)","v":3.3},{"$f":"IF(AND($G15=\"Y\",OR($D15=1,$D15=2,$D15=3,$D15=4,$D15=8,$D15=9,$D15=10)),2.15,S19)","v":3.3},{"$f":"IF(AND($G16=\"Y\",OR($D16=1,$D16=2,$D16=3,$D16=4,$D16=8,$D16=9,$D16=10)),2.15,T19)","v":3.3},"V/V/N/N/N 40%",0.4,0.16]
[{"$nulls":14},"Reserve eligibility code",{"$f":"IF(AND($D12=11,$G12=\"Y\"),2.15,P20)","v":3.3},{"$f":"IF(AND($D13=11,$G13=\"Y\"),2.15,Q20)","v":3.3},{"$f":"IF(AND($D14=11,$G14=\"Y\"),2.15,R20)","v":3.3},{"$f":"IF(AND($D15=11,$G15=\"Y\"),2.15,S20)","v":3.3},{"$f":"IF(AND($D16=11,$G16=\"Y\"),2.15,T20)","v":3.3},"V/N 50%",0.5,0.14286]
[null,"Section II - Borrower Equity Requirement",{"$nulls":12},"Surviving Spouse/POW eligibility code",{"$f":"IF(OR($D12=6,$D12=7),0,P21)","v":3.3},{"$f":"IF(OR($D13=6,$D13=7),0,Q21)","v":3.3},{"$f":"IF(OR($D14=6,$D14=7),0,R21)","v":3.3},{"$f":"IF(OR($D15=6,$D15=7),0,S21)","v":3.3},{"$f":"IF(OR($D16=6,$D16=7),0,T21)","v":3.3},"V/V/V/N/N 60%",0.6,0.12,null,"Information is Gathered from the new loan information"]
{"$rows_left_out":66}
{"sheet":"county limits","index":3,"n_rows":3239,"n_cols":11,"rows_kept":3239}
["State1",null,"State2","County Name","One-Unit Limit",{"$nulls":3},"State2","County Name","One-Unit Limit"]
[null,null,{"$f":"ST","v":0}]
[]
["State1",null,"State2","County Name","One-Unit Limit"]
["AL",null,"AL","AUTAUGA COUNTY",{"v":832750,"d":"$832,750"}]
["AK",null,"AL","BALDWIN COUNTY",{"v":832750,"d":"$832,750"}]
["AZ",null,"AL","BARBOUR COUNTY",{"v":832750,"d":"$832,750"}]
["AR",null,"AL","BIBB COUNTY",{"v":832750,"d":"$832,750"}]
["CA",null,"AL","BLOUNT COUNTY",{"v":832750,"d":"$832,750"}]
["CO",null,"AL","BULLOCK COUNTY",{"v":832750,"d":"$832,750"}]
["CT",null,"AL","BUTLER COUNTY",{"v":832750,"d":"$832,750"}]
["DE",null,"AL","CALHOUN COUNTY",{"v":832750,"d":"$832,750"}]
["DC",null,"AL","CHAMBERS COUNTY",{"v":832750,"d":"$832,750"}]
["FL",null,"AL","CHEROKEE COUNTY",{"v":832750,"d":"$832,750"}]
["GA",null,"AL","CHILTON COUNTY",{"v":832750,"d":"$832,750"}]
["HI",null,"AL","CHOCTAW COUNTY",{"v":832750,"d":"$832,750"}]
["ID",null,"AL","CLARKE COUNTY",{"v":832750,"d":"$832,750"}]
["IL",null,"AL","CLAY COUNTY",{"v":832750,"d":"$832,750"}]
["IN",null,"AL","CLEBURNE COUNTY",{"v":832750,"d":"$832,750"}]
["IA",null,"AL","COFFEE COUNTY",{"v":832750,"d":"$832,750"}]
{"$rows_left_out":3219}